{"text_format":"1","workbook":"xlsx","n_sheets":13,"sheets":["1. Trip Generation","2. MMLOS","3. TDM","SUMMARY","Narrative Prompts","OUTPUT","Maximum Calcs","Neighborhood","Transit","CTR","Assumptions","Info_Notes","Glossary"],"not_rendered":{"charts":0,"images":23,"macros":1,"external_links":0,"defined_names":9,"comments":5,"pivot_tables":0},"unopened":[],"bounds":{"document_bytes":16777216,"sheet_cells":100000,"rows_first":2000,"rows_last":500,"rows_between":2000,"halvings":0,"cell_chars":16384,"cell_head_chars":4096},"cells_cut":0,"cells_raw":0,"read":"whole","date_system":"1900"}

{"sheet":"1. Trip Generation","index":0,"n_rows":43,"n_cols":8,"rows_kept":43,"cut":false,"hidden":false,"merged":[[18,1,18,7],[0,0,0,7],[15,1,15,7],[43,0,44,6],[2,0,2,7],[36,1,36,3],[36,4,36,6],[22,2,22,7],[23,2,23,4],[23,5,23,7],[30,0,30,1],[34,1,34,6],[35,1,35,6],[20,0,20,1],[17,1,17,7],[16,1,16,7],[22,1,24,1],[22,0,24,0],[31,0,32,7]]}
["Trip Generation"]
[]
[]
[]
[]
[]
[]
[]
[]
[]
{"$rows_left_out":34}
{"sheet":"2. MMLOS","index":1,"n_rows":123,"n_cols":7,"rows_kept":123,"cut":false,"hidden":false,"merged":[[37,1,37,5],[50,1,50,5],[68,1,68,5],[42,1,49,1],[42,2,46,2],[1,1,1,6],[55,1,67,1],[55,2,62,2],[22,2,22,5],[28,2,28,5],[14,2,16,2],[10,2,12,2],[13,2,13,5],[2,1,2,6],[33,2,33,5],[17,2,17,5],[67,2,67,5],[63,2,63,5],[64,2,66,2],[47,2,47,5],[49,2,49,5],[10,1,36,1],[36,2,36,5],[34,2,35,2],[7,3,7,4],[18,2,21,2],[29,2,32,2],[23,2,27,2]]}
[]
[null,"MMLOS Input Page"]
[null,"Instructions: Answer Yes, No, or Not Applicable to each measure under the Pedestrian, Bike and Transit sections. "]
[]
[null,null,null,null,null,null,"= input"]
[null,null,null,null,null,null,"= calculation"]
[]
[null,null,null,"TOTAL NUMBER OF TRIPS MITIGATED:",null,{"$f":"SUM(G38,G51,G69)","v":-30}]
[]
[null,"Category","Sub.","Measure Number","Question","Answer","Points"]
{"$rows_left_out":114}
{"sheet":"3. TDM","index":2,"n_rows":112,"n_cols":18,"rows_kept":112,"cut":false,"hidden":false,"merged":[[65,3,65,6],[10,1,10,3],[37,3,37,5],[38,3,38,5],[35,3,35,5],[24,1,38,1],[27,3,27,5],[32,3,32,5],[11,2,12,2],[14,2,17,2],[24,2,26,2],[28,2,31,2],[33,2,34,2],[41,2,42,2],[44,2,46,2],[48,2,49,2],[7,1,8,6],[89,6,90,6],[85,6,87,6],[69,3,69,6],[16,16,16,23],[24,6,26,6],[28,6,31,6],[33,6,34,6],[41,6,42,6],[47,3,47,6],[50,3,50,6],[54,3,54,6],[58,3,58,6],[21,3,21,5],[43,3,43,6],[62,3,62,6],[92,3,92,5],[44,6,46,6],[48,6,49,6],[51,6,53,6],[55,6,57,6],[59,6,61,6],[63,6,64,6],[66,6,68,6],[73,3,73,6],[77,3,77,6],[70,3,72,3],[84,3,84,6],[88,3,88,6],[91,3,91,6],[80,3,80,6],[81,6,83,6],[2,1,3,6],[70,6,72,6],[74,6,76,6],[78,6,79,6],[41,1,92,1],[11,3,12,3],[13,3,13,5],[14,3,17,3],[18,3,18,5],[20,3,20,5],[11,1,21,1],[11,6,12,6],[14,6,17,6],[24,3,26,3],[28,3,31,3],[33,3,34,3],[108,1,108,3],[41,3,42,3],[44,3,46,3],[48,3,49,3],[51,3,53,3],[55,3,57,3],[59,3,61,3],[63,3,64,3],[66,3,68,3],[78,3,79,3],[81,3,83,3],[85,3,87,3],[89,3,90,3],[74,3,76,3],[94,1,94,5],[95,1,95,5],[51,2,53,2],[55,2,57,2],[59,2,61,2],[63,2,64,2],[66,2,68,2],[89,2,90,2],[70,2,72,2],[74,2,76,2],[78,2,79,2],[81,2,83,2],[85,2,87,2]]}
[]
[]
[null,"TDM Input Page"]
[]
[]
[]
[]
[]
[]
[null,"Category","Measure Number","Sub. ","Question","Answer ","Strategy VMT Reductions"]
{"$rows_left_out":103}
{"sheet":"SUMMARY","index":3,"n_rows":53,"n_cols":24,"rows_kept":53,"cut":false,"hidden":false,"merged":[[14,0,14,5],[6,1,6,5],[0,0,1,5],[51,0,51,5],[3,1,3,5],[4,1,4,5],[5,1,5,5],[9,0,9,1],[8,0,8,5],[9,2,9,4],[9,5,10,5],[45,1,45,3],[44,1,44,3],[33,1,33,3],[34,1,34,3],[43,1,43,3],[52,0,52,5],[46,1,46,3],[47,1,47,3],[49,2,49,3],[42,1,42,3],[35,1,35,3],[37,1,37,3],[38,1,38,3],[41,1,41,3],[27,1,27,3],[28,1,28,3],[29,1,29,3],[31,1,31,3],[32,1,32,3],[30,1,30,3],[36,1,36,3],[39,1,39,3],[40,1,40,3]]}
["Summary and Narrative: ",null,null,null,null,null,null,null,null,null,null,null,null,null,null,null,null,null,null,null,null,null,null,"The Level One TIA Outline:\n1) Introductory Items\n    • Front Cover / Title Page\n    • Table of Contents, List of Figures, and List of Tables\n2) Introduction\n    • Project Description\n    • Project applicant/contact info \n    • Site plan (include proposed driveways, roadways, traffic control, parking facilities, emergency vehicle access, and internal circulation for vehicles,\n        bicyclists, and pedestrians)\n    • Location map (include major streets, study intersections, and neighboring zoning and land uses)\n3) Project Trip Generation using the City of Aspen specific trip generation figures (Table A-1 and A-2 in Appendix A)\n    • AM Peak Trips by Land Use and for entire Project\n    • PM Peak Trips by Land Use and for entire Project\n4) Proposed new and/or improved TDM and MMLOS Mitigation Program (Based off TDM and MMLOS Mitigation Tools)\n    • Copies of completed TDM and MMLOS toolkit spreadsheets \n    • TDM Measure Details (including location of measures, effectiveness of measures for project, implementation details)\n    • MMLOS Measure Details (including location of measures, effectiveness of measures for project, implementation details)\n    • Enforcement & Financing\n    • Scheduling and implementation responsibility of mitigation measures\n5) Monitoring Report\n    • Assessment of Compliance with Guidelines\n    • Results and effectiveness of implemented measures \n    • Identification of Additional Strategies\n    • Surveys and other supporting data\n"]
[]
[]
["DATE:",{"$f":"IF('1. Trip Generation'!B16=\"\",\"\",'1. Trip Generation'!B16)","v":""}]
["PROJECT NAME:",{"$f":"IF('1. Trip Generation'!B17=\"\",\"\",'1. Trip Generation'!B17)","v":""}]
["PROJECT ADDRESS:",{"$f":"IF('1. Trip Generation'!B18=\"\",\"\",'1. Trip Generation'!B18)","v":""}]
["APPLICANT CONTACT INFORMATION:\nNAME, COMPANY, ADDRESS, PHONE, EMAIL",{"$f":"'1. Trip Generation'!B19:H19","v":"Name\nCompany\nAddress\nPhone\nEmail"}]
[]
["SUMMARY"]
["Trip Generation",null,"Trip Mitigation",null,null,"NET TRIPS TO BE MITIGATED"]
{"$rows_left_out":44}
{"sheet":"Narrative Prompts","index":4,"n_rows":72,"n_cols":10,"rows_kept":72,"cut":false,"hidden":true,"merged":[[29,1,36,1],[37,1,39,1],[71,0,80,5],[2,1,4,1],[5,1,7,1],[8,1,11,1],[12,1,16,1],[17,1,20,1],[21,1,22,1],[23,1,27,1]]}
["MMLOS"]
["Category","Sub. Category","Question","Does the Measure Require a Narrative Prompt? ","Does the Measure Require a Site Map? ","Did the Applicant Choose the Measure and the Measure Requires a Narrative Prompt? ","Did the Applicant Choose the Measure and the Measure Requires a Site Plan Prompt? ","Narrative Prompt","Site Map Prompt"]
[null,"Sidewalk Condition on Project Frontage",{"$f":"'2. MMLOS'!E11","v":"Does the project propose a detached sidewalk where an attached sidewalk currently exists? Does the proposed sidewalk and buffer meet standard minimum widths? "},"Yes","Yes",{"$f":"IF('2. MMLOS'!$F11=\"Yes\",IF(D3=\"Yes\",\"Yes\",\"No\"),\"No\")","v":"No"},{"$f":"IF('2. MMLOS'!$F11=\"Yes\",IF(E3=\"Yes\",\"Yes\",\"No\"),\"No\")","v":"No"},"In the space provided call out the effective sidewalk width and the percentage of the site which meets or exceeds the minimum standard width. Explain the site constraints for areas which do not meet the minimum width. ","Sidewalk Width and Buffer Width","Display the detached sidewalk and buffer widths. Effective sidewalk width takes into account a 2' shy distance from buildings. Obstructions such as benches, grates, and planters reduce the effective sidewalk width to the width which remains clear at all times. "]
[null,null,{"$f":"'2. MMLOS'!E12","v":"Is the proposed effective sidewalk width greater than the standard minimum width?"},"No","No",{"$f":"IF('2. MMLOS'!$F12=\"Yes\",IF(D4=\"Yes\",\"Yes\",\"No\"),\"No\")","v":"No"},{"$f":"IF('2. MMLOS'!$F12=\"Yes\",IF(E4=\"Yes\",\"Yes\",\"No\"),\"No\")","v":"No"},"NA","NA","NA"]
[null,null,{"$f":"'2. MMLOS'!E13","v":"Does the project propose a landscape buffer greater than the standard minimum width?"},"No","No",{"$f":"IF('2. MMLOS'!$F13=\"Yes\",IF(D5=\"Yes\",\"Yes\",\"No\"),\"No\")","v":"No"},{"$f":"IF('2. MMLOS'!$F13=\"Yes\",IF(E5=\"Yes\",\"Yes\",\"No\"),\"No\")","v":"No"},"NA","NA","NA"]
[null,"Sidewalk Condition on Adjacent Blocks",{"$f":"'2. MMLOS'!E15","v":"Does the project propose a detached sidewalk on an adjacent block? Does the proposed sidewalk and buffer meet standard minimum widths? "},"Yes","Yes",{"$f":"IF('2. MMLOS'!$F15=\"Yes\",IF(D6=\"Yes\",\"Yes\",\"No\"),\"No\")","v":"No"},{"$f":"IF('2. MMLOS'!$F15=\"Yes\",IF(E6=\"Yes\",\"Yes\",\"No\"),\"No\")","v":"No"},"A detached sidewalk is proposed on an adjacent block. Explain below how this improvement ties into the proposed project. ","Detached Sidewalk on Adjacent Property","Show the proposed detached sidewalk on an adjacent block. "]
[null,null,{"$f":"'2. MMLOS'!E16","v":"Is the proposed effective sidewalk width on an adjacent block greater than the standard minimum width?"},"No","Yes",{"$f":"IF('2. MMLOS'!$F16=\"Yes\",IF(D7=\"Yes\",\"Yes\",\"No\"),\"No\")","v":"No"},{"$f":"IF('2. MMLOS'!$F16=\"Yes\",IF(E7=\"Yes\",\"Yes\",\"No\"),\"No\")","v":"No"},"NA","Sidewalk width on adjacent property","The project proposes to install a sidewalk with an effective width greater than the standard minimum width on an adjacent block off-site. Demonstrate on site plan.  "]
[null,null,{"$f":"'2. MMLOS'!E17","v":"Is the proposed landscape buffer on an adjacent block greater than the standard minimum width?"},"No","Yes",{"$f":"IF('2. MMLOS'!$F17=\"Yes\",IF(D8=\"Yes\",\"Yes\",\"No\"),\"No\")","v":"No"},{"$f":"IF('2. MMLOS'!$F17=\"Yes\",IF(E8=\"Yes\",\"Yes\",\"No\"),\"No\")","v":"No"},"NA","Landscape Buffer on Adjacent Property","Proposed landscape buffer width is greater than the standard minimum width on an adjacent block off-site. Demonstrate on site plan. "]
[null,"Pedestrian Routes",{"$f":"'2. MMLOS'!E19","v":"Are slopes between back of curb and sidewalk equal to or less than 5%?"},"No","Yes",{"$f":"IF('2. MMLOS'!$F19=\"Yes\",IF(D9=\"Yes\",\"Yes\",\"No\"),\"No\")","v":"No"},{"$f":"IF('2. MMLOS'!$F19=\"Yes\",IF(E9=\"Yes\",\"Yes\",\"No\"),\"No\")","v":"No"},null,"Slopes Between Back of Curb and Sidewalk","Slopes between back of curb and sidewalk are equal to or less 5%. Call this out on the site plan. "]
[null,null,{"$f":"'2. MMLOS'!E20","v":"Are curbs equal to (or less than) 6 inches?"},"No","No",{"$f":"IF('2. MMLOS'!$F20=\"Yes\",IF(D10=\"Yes\",\"Yes\",\"No\"),\"No\")","v":"No"},{"$f":"IF('2. MMLOS'!$F20=\"Yes\",IF(E10=\"Yes\",\"Yes\",\"No\"),\"No\")","v":"No"},"NA","NA","NA"]
{"$rows_left_out":63}
{"sheet":"OUTPUT","index":5,"n_rows":53,"n_cols":9,"rows_kept":53,"cut":false,"hidden":true,"merged":[[1,2,1,8],[2,2,2,8],[4,2,4,5],[5,2,5,5]]}
[]
[null,null,"Global Maximum Reduction (all VMT)"]
[null,null,{"$f":"'Maximum Calcs'!C7","v":{"$error":"#N/A"}}]
[]
[null,null,"Cross-Category Max Reduction (All VMT)",null,null,null,null,null,"Max Reduction (all VMT):"]
[null,null,{"$f":"'Maximum Calcs'!C23","v":{"$error":"#N/A"}},null,null,null,null,null,{"$f":"'Maximum Calcs'!D74","v":0}]
[]
[]
[null,null,"Neighborhood/ Site Enhancements",null,null,"Transit System",null,null,"Commute Trip Reduction (CTR) Progams\n(assuming mixed-use development)"]
[null,null,"Category Reduction (all VMT):",null,null,"Category Reduction (all VMT):",null,null,"Category Reduction (work VMT):"]
{"$rows_left_out":44}
{"sheet":"Maximum Calcs","index":6,"n_rows":110,"n_cols":9,"rows_kept":110,"cut":false,"hidden":true,"merged":[[109,1,109,10],[8,2,9,9],[24,2,25,9],[70,2,70,9],[85,3,86,8],[58,3,59,8],[106,2,106,9],[74,4,76,8],[73,4,73,5],[73,7,73,8],[3,1,3,10],[18,1,18,10],[34,1,34,10],[51,2,51,9],[22,3,22,4],[6,3,6,4],[41,3,42,8]]}
[null,null,"= input"]
[null,null,"= calculation"]
[]
[null,"Maximum Calculations"]
[]
[]
[null,null,{"$f":"MIN(VLOOKUP('1. Trip Generation'!C21,'Maximum Calcs'!D12:E13,2,FALSE),C8)","v":{"$error":"#N/A"}},"% Global VMT Reduction"]
[null,null,{"$f":"1-(1-C16)*(1-C17)","v":{"$error":"#N/A"}},"pre-cap reduction"]
[null,null,"= Minimum (X%, 1- (1-[a])*(1-[b]))\nwhere:"]
[]
{"$rows_left_out":101}
{"sheet":"Neighborhood","index":7,"n_rows":51,"n_cols":9,"rows_kept":51,"cut":false,"hidden":true,"merged":[[29,5,29,7],[38,2,38,9],[3,1,3,10],[18,2,18,9],[50,2,50,9],[10,4,10,5],[12,5,12,6],[13,5,13,6],[14,5,14,6],[24,3,24,8],[27,5,27,7]]}
[null,null,"= input"]
[null,null,"= calculation"]
[]
[null,"Neighborhood / Site Enhancements Strategies"]
[]
[]
[null,null,null,{"$f":"IF('3. TDM'!$F$12=\"yes\",VLOOKUP(E11,F14:H15,3,FALSE),0)","v":0},"VMT Reduction"]
[]
[null,null,null,"Mitigation Method:"]
[]
{"$rows_left_out":42}
{"sheet":"Transit","index":8,"n_rows":88,"n_cols":9,"rows_kept":88,"cut":false,"hidden":true,"merged":[[87,2,87,9],[54,4,54,5],[56,5,56,6],[57,5,57,6],[58,5,58,6],[62,2,62,9],[74,2,74,9],[3,1,3,10],[22,2,22,9],[47,2,47,9],[9,3,10,8],[28,3,29,8],[36,5,36,6]]}
[null,null,"= input"]
[null,null,"= calculation"]
[]
[null,"Transit System Improvements Strategies"]
[]
[]
[null,null,null,{"$f":"IF('3. TDM'!F25=\"yes\",E13*E14*E18*E19,0)","v":0},"VMT Reduction"]
[]
[null,null,null,"Mitigation Method:"]
[null,null,null,"% Reduction in VMT = % increase in transit network coverage * elasticity of transit ridership w.r.t. service coverage * existing transit mode share * adjustment from transit ridership increase to VMT"]
{"$rows_left_out":79}
{"sheet":"CTR","index":9,"n_rows":246,"n_cols":14,"rows_kept":246,"cut":false,"hidden":true,"merged":[[92,2,92,9],[171,5,171,6],[162,2,162,9],[168,3,168,8],[137,5,137,6],[118,3,118,8],[154,5,154,6],[134,3,134,8],[102,5,102,7],[151,3,151,8],[145,2,145,9],[128,2,128,9],[112,2,112,9],[108,5,108,7],[245,2,245,9],[201,5,201,7],[192,2,192,9],[155,5,155,6],[217,3,217,8],[173,5,173,6],[237,3,237,8],[210,2,210,9],[226,5,226,7],[230,2,230,9],[180,2,180,9],[83,5,83,6],[99,3,99,8],[3,1,3,10],[37,2,37,9],[53,2,53,9],[72,2,72,9],[78,3,78,8],[28,5,28,8],[26,5,26,8],[43,3,43,8],[64,5,64,8],[9,3,9,8],[59,3,59,8],[17,2,17,9],[62,5,62,8],[23,3,23,8]]}
[null,null,"= input"]
[null,null,"= calculation"]
[]
[null,"Commute Trip Reduction (CTR) Programs and School Strategies"]
[]
[]
[null,null,null,{"$f":"IF('3. TDM'!F42=\"yes\",E12*E13*E14,0)","v":0},"commute VMT Reduction"]
[]
[null,null,null,"Mitigation Method:"]
[null,null,null,"% Reduction in commute VMT =  % reduction in commute vehicle trips * % employees eligible * adjustment from commute VT to commute VMT"]
{"$rows_left_out":237}
{"sheet":"Assumptions","index":10,"n_rows":120,"n_cols":7,"rows_kept":120,"cut":false,"hidden":true,"merged":[[3,1,3,10],[40,1,40,10],[38,2,38,9],[61,2,61,9],[64,1,64,10],[16,2,16,9],[18,1,18,10],[27,1,27,10],[33,2,33,9],[25,2,25,9],[119,1,119,10],[114,3,114,8],[49,2,49,9],[55,2,55,9],[73,2,73,9],[81,2,81,9],[117,2,117,9],[89,3,89,8],[96,3,96,8]]}
[null,null,"= input"]
[null,null,"= calculation"]
[]
[null,"Assumptions Page"]
[]
[]
[]
[null,null,null,null,"Trip Type","Weekday %"]
[null,null,null,null,"HBW",0.218]
[null,null,null,null,"HBShop",0.25600000000000001]
{"$rows_left_out":111}
{"sheet":"Info_Notes","index":11,"n_rows":23,"n_cols":6,"rows_kept":23,"cut":false,"hidden":false,"merged":[[1,5,3,5],[4,5,8,5],[9,5,22,5]]}
["Index","Description","Input Instructions","Sources/Notes","Percent Applicable"]
["On-Site Services ","Providing creative onsite amenities reduces the need for SOV trips throughout the day. Services within the development that will reduce the need for auto trips include healthy vending, grocery, restaurant, recreation rental, dry cleaning, child care, bicycle repair stations, etc. ",null,"Seggerman, K., & Hendricks, S. (2005). Incorporating TDM Into the Land Development Process. National Center for Transit Research, Center for Urban Transportation Research.",null,"Neighborhood"]
["Shared Shuttle Service","The use of hotel or other customer service vehicles to shuttle employees can maximize the use of on-site resources while reducing SOV trips. The successful project will creatively consider the use of necessary business vehicles for shuttle purposes. For example, a health club with a guest shuttle could provide employee transfers to a transit center or park and ride.","Degree of implementation: low (< 10 vans), medium (<30 vans), large (>30 vans)                                            Company size: small (< 100 employees), medium (< 500), large (>500) "]
["Non-Motorized Zones","Larger areas of non-motorized travel zones provide safe and comfortable space that encourages walking and bicycling, thus reducing SOV trips. Non-motorized zones are applicable for larger redevelopment or specific areas only. Public amenity space already required by the City of Aspen does not qualify for this reduction. ","Only applicable to Major developments","Federal Highway Administration. (1998). Transportation and Global Climate Change: A Review and Analysis of the Literature. USDOT."]
["Network Expansion","The successful project will expand the local transit network by adding or modifying existing transit service to enhance the service near the project site. This will encourage the use of transit and therefore reduce SOV trips. ","Only applicable to Major developments",null,null,"Transit System"]
["Service Frequency","Reducing transit-passenger travel time through reduced headways and increased speed and reliability makes transit service more attractive, reducing SOV trips. The successful project will work with City of Aspen staff to develop a plan for increased service frequency that offers the best trip reduction opportunity. ","Only applicable to Major developments"]
["Transit Access Improvement","Provision of safe and comfortable access to transit service is important for generating and maintaining transit ridership, thus reducing SOV trips. The successful project will improve pedestrian access to a transit stop via formalization of trails, addition and/or improvement of sidewalk, installation of lighting and/or way finding or other measures. "]
["Intercept Lot","The provision of a convenient location at which to park a vehicle and transfer onto an alternative mode can reduce SOV trips. The successful project will provide for a safe, convenient intercept lot at an appropriate location. Alternatively, a project can propose methods by which existing intercept lot use can be expanded. Examples include shuttles to/from existing lots, improvements to existing lots, etc. ",null,"Federal Highway Administration. (1998). Transportation and Global Climate Change: A Review and Analysis of the Literature. USDOT."]
["Bus Stops with Real Time Arrival","The successful project will provide real time arrival signage to accurately inform users of the bus schedule. ",null,"Study of Chicago Transit Authority implementation of real-time tracking  on 141 of 144 system buses over a one-year periord from 2008 - 2009 found a 1.8 - 2.2% increase in ridership.Tang, L., & Thakuriah, P. (2012, June). Ridership effects of real-time bus information system: A case study in the City of Chicago. Transportation Research Part C: Emerging Technologies, 22, 146-161."]
["Participation in TOP","The Transportation Options Program (TOP) is a City of Aspen operated employer trip reduction service. All TOP employer services are free and include grant opportunities, emergency ride home services, materials, and bus schedule kiosks and distribution. The successful project will work with City of Aspen staff to determine whether TOP membership is appropriate and, if so, to join the program. ",null,null,null,"Commute Trip Reduction"]
{"$rows_left_out":14}
{"sheet":"Glossary","index":12,"n_rows":14,"n_cols":3,"rows_kept":14,"cut":false,"hidden":false,"merged":[[1,1,1,2]]}
[]
[null,"Glossary"]
[]
[null,"Transportation Impact Analysis (TIA)","Transportation Demand Management (TDM) is the application of strategies and policies to reduce travel demand (specifically that of single-occupancy vehicles) "]
[null,"Multi-Modal Level of Service (MMLOS)","Multi-Modal Level of Service (MMLOS) evaluates the safety and quality of access and flow for pedestrians and bicyclists. "]
[null,"Transportation Demand Management (TDM)","Transportation Demand Management (TDM) is the application of strategies and policies to reduce travel demand (specifically that of single-occupancy vehicles)"]
[]
[]
[null,"Access Point","An access point is any location on the site where pedestrians, bicycles, or vehicles access the property. "]
[null,"Detached Sidewalk","A detached sidewalk has a buffer area between the sidewalk and street. "]
{"$rows_left_out":4}